{"text_format":"1","workbook":"xlsx","n_sheets":10,"sheets":["Table of Contents","Overview","Risk Descriptions","Phase 1","Phase 2","Phase 3","Phase 4","Dashboard","Parameters","Approach"],"not_rendered":{"charts":1,"images":10,"macros":1,"external_links":0,"defined_names":1,"comments":0,"pivot_tables":0},"unopened":[],"bounds":{"document_bytes":16777216,"sheet_cells":100000,"rows_first":2000,"rows_last":500,"rows_between":2000,"halvings":0,"cell_chars":16384,"cell_head_chars":4096},"cells_cut":0,"cells_raw":0,"read":"whole","date_system":"1900"}

{"sheet":"Table of Contents","index":0,"n_rows":25,"n_cols":3,"rows_kept":25,"cut":false,"hidden":false,"merged":[[16,2,16,3],[22,2,22,3],[13,2,13,3],[1,1,1,18],[3,2,3,3],[6,2,6,4],[9,2,9,4],[14,2,14,18]]}
[]
[null,"Table of Contents"]
[]
[null,"1.","Overview Tab"]
[null,null,"aProvides the migrating agency guidance and instruction on how to utilize and understand the different components inside of the tabs"]
[]
[null,"2.","Risk Descriptions Tab"]
[null,null,"aLists and describes each risk that will be used to evaluate the migrating agencies over each Phase "]
{"$rows_left_out":18}
{"sheet":"Overview","index":1,"n_rows":317,"n_cols":3,"rows_kept":317,"cut":false,"hidden":false,"merged":[[1,1,1,3],[316,2,316,3],[3,4,3,5],[3,2,3,3],[244,2,244,3],[68,2,68,3],[168,2,168,3]]}
[]
[null,"Directions:  \nAll the information required to navigate the Risk Tool can be found in this tab.\nScroll down to find instructions and descriptions for each tab found in this workbook."]
[]
[null,"Tab:","Risk Descriptions "]
[]
[]
[]
[]
{"$rows_left_out":310}
{"sheet":"Risk Descriptions","index":2,"n_rows":14,"n_cols":5,"rows_kept":14,"cut":false,"hidden":false,"merged":[[0,0,0,1]]}
["*Risks below are not prioritized*",null,"OSSPI Risk List"]
["ID","Risk Type","Risk Description","M3 Artifacts","Key Metrics"]
[1,"Data/Information Risk","Risk(s) associated with the ability to comply with OMB's and OCIO's data requirements.  Information reported must be timely, reliable, and consistent. This includes risk(s) associated with data conversion and data migration, the loss/misuse of data or information, risk of increased burdens on citizens, government employees and systems uses due to data collection requirements if the associated business processes or the investment require access to data from other sources. ","● Business Needs Workbook\n● Conversion Defect Log\n● Data Cleansing Plan\n● Data Conversion Plan\n● Data Governance Model\n● Data Management/Data Quality Approach\n● Gap Analysis Report\n● Master Schedule\n● Mock Conversion Report\n\n\n","● Data quality assessment identifying data concerns completed/updated in Data Cleansing Plan (Phases 1-3)\n● % of Conversion Plan execution (Phase 4)\n● % of Conversion test cases completed (Phase 4)"]
[2,"Cyber Information Security Risk","Risk that could expose the agency to exploitation of vulnerabilities to compromise the confidentiality, integrity, or availability of the information being processed, stored, or transmitted by its information systems. This includes privacy risk(s) for individuals associated with personally identifiable information (PII) and general (i.e. non-sensitive) security risks associated with the investment, such as risk(s) associated with the development of the investment's Security Plan, as well as the commercial feasibility of security requirements. ","● Business capabilities as documented in Operational End State \n● Gap Analysis Report\n● Integrated Master Schedule (IMS)\n● Interface plan\n● Privacy Impact Assessment\n● Target State Systems Environment \n\n\n\n","●  Number of interconnection agreements required (Phases 4)\n●  Number of PII data elements identified in legacy application that must be converted/transferred (Phase 4)\n●  Number of Security GAPS (Phase 3)\n●  Number of Agency specific Security requirements (Phases 2-3)"]
[3,"Financial Risk","Risk(s) that could result in a negative impact to the agency, such as the waste or loss of funds/assets and government-wide costs for a lack of the adoption of standards (e.g. on schedule, without protest). This includes risk(s) associated with an incomplete or inaccurate cost estimate at the start and planning phases of the investment, as well as those associated with the ability of the system to achieve the program's lifecycle cost objectives and estimate assumptions. Also includes risk associated with funding methodology whether being centrally funded by Department through appropriation or funded by individual components via Working Capital Fund (WCF) or other taxing mechanism.  The investment team should have the ability to meet overall cost goals and meet planning, developing, operations, and disposition cost breakdowns within acceptable thresholds. ","● Business Needs Workbook\n● Cost Savings Table\n● Gap Analysis Report\n● Major IT Business Case (MITBC) including LCCE\n● Preliminary Cost/Savings Table\n● Vision and Operational End State\n\n\n\n","●  Schedule Variance (Phases 1-4)\n●  Schedule Variance % (Phases 1-4)\n● Total change from Prior Year Presidential budget (change in dollars) (All Phases)\n● Total change from Prior Year Presidential budget (change in %) (All Phases)\n\n"]
[4,"Acquisition and Procurement Risk","Risk(s) associated with the acquisition of contracts and contract management necessary to support the investment. Addresses the risk in developing the acquisition package and executing successfully. This includes the development of the RFP, the risk of contractor selection, and the risk of contractor protest. This also includes the risk of continuity for the life of the contract and the ability to acquire and manage resources needed to complete the program as planned. This risk includes the ability of supporting contractors to meet the required reports (e.g. Status Reports, Risk Register) and other deliverables on time and of acceptable quality. Considerations include whether the agency has the appropriate level of contractor oversight so that the government effectively monitors, controls, and mitigates risks. Controls should be in place so that adverse contractor performance is identified early and that appropriate risk mitigation measures are implemented successfully. ","● Major IT Business Case (MITBC)\n● Project Business Case\n● Procurement Plan\n● Provider Assessment Report\n● Vision and Operational End State\n\n\n\n","● % of Acquisitions Awarded per IMS award milestone (Phases 1-4)\n●  % of IMS milestone dates met by baseline date  (Phases 1-4)\n●  Number of non-administrative modifications to Contracts and Inter-Agency Agreements (IAA's), (i.e., Contract Revisions [CRs]) (Phases 3-4)"]
[5,"Operational Risk","Risk of direct or indirect loss or other negative effects to the organization due to inadequate or failed internal processes arising from people, systems, or from external events that impact those internal processes, people, or systems. Operational risks can have a direct impact on daily operations of an organization or prevent an organization from accomplishing its objectives (meeting the mission). This involves risk that the investment fails to achieve the agency's strategic goals or in making contributions to them. Risk that the initiative is not based on clearly understood needs or opportunities and is inconsistent with the overall strategies and architectures used by the agency and the Federal government. ","● Baseline Performance and Success Metrics\n● Business Needs Workbook\n● Business Requirements\n● Contingency Plan\n● Go/No-Go Assessment Report\n● Implementation approach / timeline\n● Integrated Contact Center Strategy\n● Major IT Business Case (MITBC)\n● Project Business Case\n● Service Level Agreement (SLA)\n● Target Performance and Success Metrics\n● Target State Concept of Operations\n● Vision and Operational End State\n\n\n\n","● Schedule Variance (Phases 2-4)\n● Schedule Variance % (Phases 2-4)\n● Baseline Performance and Success Metrics available (Phase 1)\n● % of Business Needs available in provider solution versus fit/gaps identified (Phase 2)\n● Number of Agency-unique interfaces identified as complex or highly complex by selected provider (Phase 4)\n"]
[6,"Reputational Risk","Risk(s) Risk that a failure to manage risk, external events, and external media or to fail to fulfill the agency’s role (whether such failure is accurate or perceived) could diminish the stature, credibility\nor effectiveness of the agency. Also associated with the size of the organization that will be affected by the migration. Factors such as geographic distribution of the organization, or whether the migration is intended to move an entire organization or specific components/business units within the organization.  Includes scope of services - system only, services only or both.","● Business Needs Workbook (Customer Profile)\n● Initial Scope of Services\n● Organizational & Change Management Plan\n● Provider Assessment Report\n● Vision and Operational End State\n"]
{"$rows_left_out":7}
{"sheet":"Phase 1","index":3,"n_rows":39,"n_cols":12,"rows_kept":39,"cut":false,"hidden":false,"merged":[[5,0,5,3],[5,4,5,11],[1,4,3,7],[1,2,3,2],[4,4,4,7]]}
[]
["Phase 1 ","Cumulative Risk Ratings","Phase 1: Objective is to prepare the migrating organization by defining initial scope of services and customer governance for the modernization effort.",null,"Directions: Agency self-assessment of the migration's risk profile by phase based on OSSPI's priority risk categories and artifacts. Consider risk statement(s) by risk category for each level to determine current risk. "]
["Agency Self -assessment",{"$f":"IFERROR(AVERAGEIF(G8:G19,\">0\",G8:G19),\"\")","v":""}]
["Overall OSSPI Rating",{"$f":"IFERROR(AVERAGEIF(K8:K19,\">0\",K8:K19),\"\")","v":""}]
[null,null,null,null,"Click here to see the Minimum Documentation required for this Phase"]
["Phase 1 Risk Evaluation Criteria",null,null,null,"Assessment"]
["Risk Category","Low ","Medium","High","Agency Rating","Agency Value","Agency Weighted Value","Agency Applied Risk Mitigation Strategy","OSSPI Rating","OSSPI Value","OSSPI Weighted Value","OSSPI Comments"]
["Data/Information Risk","● There are no data quality concerns with legacy data, or identified data quality concerns are unlikely to impact migration \n● Data quality concerns have been identified in the Data Cleansing Plan and cleansing activities are fully reflected in Initial Master Schedule","● Data quality concerns with legacy data that may impact migration are not fully addressed in the Data Cleansing Plan \n● Data quality concerns have been identified in the Data Cleansing Plan, but activities are not fully reflected in Initial Master Schedule ","● Severe data quality concerns with legacy data  that will impact migration are identified in the Data Cleansing Plan\n● Data Quality concerns have been identified in the Data Cleansing Plan, but activities are not identified on Initial Master Schedule\n",null,{"$f":"IF(OR(B8=\"not assessed\",C8=\"not assessed\",D8=\"not assessed\"),\"N/A\",IF(E8=\"Low\",1,IF(E8=\"Medium\",3,IF(E8=\"High\",5,\"\"))))","v":""},{"$f":"F8*IF(Dashboard!$Q$22=\"Small\",(Parameters!C16),IF(Dashboard!$Q$22=\"Large\",(Parameters!D16)))","v":{"$error":"#VALUE!"}},"<<Enter Your agency's Justification or Mitigation Strategies here, and rate yourself to the left with the dropbdown box>>",null,{"$f":"IF(OR(B8=\"not assessed\",C8=\"not assessed\",D8=\"not assessed\"),\"N/A\",IF(I8=\"Low\",1,IF(I8=\"Medium with Accepted Risk Strategy\",2,IF(I8=\"Medium\",3,IF(I8=\"High with Accepted Risk Strategy\",4,IF(I8=\"High\",5,IF(I8=\"N/A\",\"\",\"\")))))))","v":""},{"$f":"(IF(J8=\"n/a\",\"N/A\",IF(Dashboard!$Q$22=\"Small\",(Parameters!C16),IF(Dashboard!$Q$22=\"Large\",(Parameters!D16)))*J8))","v":{"$error":"#VALUE!"}}]
{"$rows_left_out":32}
{"sheet":"Phase 2","index":4,"n_rows":42,"n_cols":12,"rows_kept":42,"cut":false,"hidden":false,"merged":[[5,0,5,3],[5,4,5,11],[1,4,3,7],[1,2,3,2],[4,4,4,7]]}
[]
["Phase 2 ","Cumulative Risk Ratings","Phase 2:  Objective is to Conduct due diligence to identify and select the provider based on requirements and initial target end state \n",null,"Directions: Agency self-assessment of the migration's risk profile by phase based on OSSPI's priority risk categories and artifacts. Consider risk statement(s) by risk category for each level to determine current risk. "]
["Agency Self Assessment",{"$f":"IFERROR(AVERAGEIF(G8:G19,\">0\",G8:G19),\"\")","v":""}]
["Overall OSSPI Rating",{"$f":"IFERROR(AVERAGEIF(K8:K19,\">0\",K8:K19),\"\")","v":""}]
[null,null,null,null,"Click here to see the Minimum Documentation required for this Phase"]
["Phase 2 Risk Evaluation Criteria",null,null,null,"Assessment"]
["Risk Category","Low ","Medium","High","Agency Rating","Agency Value","Agency Weighted Value","Agency Applied Risk Mitigation Strategy","OSSPI Rating","OSSPI Value","OSSPI Weighted Value","OSSPI Comments"]
["Data/Information Risk","● Updated Data Cleansing Plan addresses data in legacy system with no identified data quality concerns anticipated to impact migration\n● Data quality concerns have been identified, Initial Data Cleansing has begun with future activities fully reflected in Initial Master Schedule\n● Progress on Data Cleansing is Reported in Governance Meetings and Status Reports/Dashboards ","● Updated Data Governance and Data Cleansing Plans have commenced with some minor issues or problems anticipated to impact migration\n● Data Cleansing activity has commenced, but updated Data Cleansing Plan does not fully address data in legacy system or identify data quality concerns anticipated to impact migration\n● Data Cleansing activities are reflected in Initial Master Schedule but  progress on Data Cleansing is not reported in Governance Meetings and Status Reports/Dashboards \n","● Updated Data Governance and Data Cleansing Plan identifies unusual data quality concerns anticipated to impact migration\n● Data Quality concerns have been identified but Data Cleansing Activities are not identified on Initial Master Schedule\n",null,{"$f":"IF(OR(B8=\"not assessed\",C8=\"not assessed\",D8=\"not assessed\"),\"N/A\",IF(E8=\"Low\",1,IF(E8=\"Medium\",3,IF(E8=\"High\",5,\"\"))))","v":""},{"$f":"F8*IF(Dashboard!$Q$22=\"Small\",(Parameters!E16),IF(Dashboard!$Q$22=\"Large\",(Parameters!F16)))","v":{"$error":"#VALUE!"}},"<<Enter Your agency's Justification or Mitigation Strategies here, and rate yourself to the left with the dropbdown box>>",null,{"$f":"IF(OR(B8=\"not assessed\",C8=\"not assessed\",D8=\"not assessed\"),\"N/A\",IF(I8=\"Low\",1,IF(I8=\"Medium with Accepted Risk Strategy\",2,IF(I8=\"Medium\",3,IF(I8=\"High with Accepted Risk Strategy\",4,IF(I8=\"High\",5,IF(I8=\"N/A\",\"\",\"\")))))))","v":""},{"$f":"(IF(J8=\"n/a\",0,IF(Dashboard!$Q$22=\"Small\",(Parameters!E16),IF(Dashboard!$Q$22=\"Large\",(Parameters!F16)))*J8))","v":{"$error":"#VALUE!"}}]
{"$rows_left_out":35}
{"sheet":"Phase 3","index":5,"n_rows":42,"n_cols":12,"rows_kept":42,"cut":false,"hidden":false,"merged":[[5,0,5,3],[5,4,5,11],[1,4,3,7],[1,2,3,2],[4,4,4,7]]}
[]
["Phase 3 ","Cumulative Risk Ratings","Phase 3:Objective is to conduct detailed planning through a fit-gap analysis and finalize the implementation roadmap",null,"Directions: Agency self-assessment of the migration's risk profile by phase based on OSSPI's priority risk categories and artifacts. Consider risk statement(s) by risk category for each level to determine current risk. "]
["Agency Self-assessment",{"$f":"IFERROR(AVERAGEIF(G8:G19,\">0\",G8:G19),\"\")","v":""}]
["Overall OSSPI Rating",{"$f":"IFERROR(AVERAGEIF(K8:K19,\">0\",K8:K19),\"\")","v":""}]
[null,null,null,null,"Click here to see the Minimum Documentation required for this Phase"]
["Phase 3 Risk Evaluation Criteria",null,null,null,"Assessment"]
["Risk Category","Low ","Medium","High","Agency Rating","Agency Value","Agency Weighted Value","Agency Applied Risk Mitigation Strategy","OSSPI Rating","OSSPI Value","OSSPI Weighted Value","OSSPI Comments"]
["Data/Information Risk","● Data Governance and Data Cleansing Plan reflect updates for activities of the Engagement Phase\n● Data Cleansing plan addresses data in legacy system with no identified data quality concerns anticipated to impact migration\n● Progress on Data Cleansing is Reported in governance meetings and Status Reports/Dashboards \n● Legacy-to-target data mapping activities have begun\n● Success criteria used to measure data quality are established and measurable\n● Data Conversion Plan is realistic","● Data Governance and Data Cleansing plans have been updated to reflect issues identified in the Gap Analysis Report\n● Data Cleansing plan does not fully address data in legacy system or identify data quality concerns anticipated to impact migration\n● Data Cleansing activities are reflected in Initial Master Schedule but progress on Data Cleansing is not Reported in governance meetings and Status Reports/Dashboards \n● Success criteria used to measure data quality are established but no plan in place to measure\n● Data Conversion Plan reflects the conversion of multiple legacy systems","● Unusual data quality concerns identified in Gap Analysis Report\n● Data Cleansing Plans have not been updated to reflect the Gap Analysis Report\n● Data Cleansing activities and Legacy-to-target data mapping activities are not identified on Master Schedule\n● No realistic timeline for future data cleansing activities have been established \n● Success criteria used to measure data quality are not realistic\n● Data Conversion Plan is not realistic based on projects of similar size and scope ",null,{"$f":"IF(OR(B8=\"not assessed\",C8=\"not assessed\",D8=\"not assessed\"),\"N/A\",IF(E8=\"Low\",1,IF(E8=\"Medium\",3,IF(E8=\"High\",5,\"\"))))","v":""},{"$f":"F8*IF(Dashboard!$Q$22=\"Small\",(Parameters!G16),IF(Dashboard!$Q$22=\"Large\",(Parameters!H16)))","v":{"$error":"#VALUE!"}},"<<Enter Your agency's Justification or Mitigation Strategies here, and rate yourself to the left with the dropbdown box>>",null,null,{"$f":"(IF(J8=\"n/a\",0,IF(Dashboard!$Q$22=\"Small\",(Parameters!G16),IF(Dashboard!$Q$22=\"Large\",(Parameters!H16)))*J8))","v":0}]
{"$rows_left_out":35}
{"sheet":"Phase 4","index":6,"n_rows":42,"n_cols":12,"rows_kept":42,"cut":false,"hidden":false,"merged":[[1,4,3,7],[5,0,5,3],[5,4,5,11],[1,2,3,2],[4,4,4,7]]}
[]
["Phase 4","Cumulative Risk Ratings","Phase 4Objective is to build, test, and deploy the new system, concept of operations, and workforce design.",null,"Directions: Agency self-assessment of the migration's risk profile by phase based on OSSPI's priority risk categories and artifacts. Consider risk statement(s) by risk category for each level to determine current risk. "]
["Agency Self-assessment",{"$f":"IFERROR(AVERAGEIF(G8:G19,\">0\",G8:G19),\"\")","v":""}]
["Overall OSSPI Rating",{"$f":"IFERROR(AVERAGEIF(K8:K19,\">0\",K8:K19),\"\")","v":""}]
[null,null,null,null,"Click here to see the Minimum Documentation required for this Phase"]
["Phase 4 Risk Evaluation Criteria",null,null,null,"Assessment"]
["Risk Category","Low ","Medium","High","Agency Rating","Agency Value","Agency Weighted Value","Agency Applied Risk Mitigation Strategy","OSSPI Rating","OSSPI Value","OSSPI Weighted Value","OSSPI Comments"]
["Data/Information Risk","● Data migration task in IMS are meeting scheduled dates, or have been successfully completed\n● A thorough and comprehensive Data Conversion Plan exists that demonstrates readiness to securely transfer information from the legacy system over to the new provider \n● Conversion testing has been completed according to Conversion Test Plan, conversion defects acceptable and resolvable after go-live\n\n","● Data migration tasks in IMS are behind scheduled dates but project implementation schedule is not at risk\n● A Data Conversion Plan that demonstrates readiness to securely transfer information from the legacy system over to the new provider, but lacks some non-critical detail\n● Some conversion testing has not been completed according to Conversion Test Plan, but conversion risk has been determined to be acceptable\n","● Data migration task in IMS are behind scheduled dates with impact to project implementation schedule\n● A Data Conversion Plan that lacks some critical details to demonstrate readiness to securely transfer information from the legacy system over to the new provider\n● Conversion test scripts have not all been successfully executed\n",null,{"$f":"IF(OR(B8=\"not assessed\",C8=\"not assessed\",D8=\"not assessed\"),\"N/A\",IF(E8=\"Low\",1,IF(E8=\"Medium\",3,IF(E8=\"High\",5,\"\"))))","v":""},{"$f":"F8*IF(Dashboard!$Q$22=\"Small\",(Parameters!I16),IF(Dashboard!$Q$22=\"Large\",(Parameters!J16)))","v":{"$error":"#VALUE!"}},"<<Enter Your agency's Justification or Mitigation Strategies here, and rate yourself to the left with the drop-down box>>",null,{"$f":"IF(OR(B8=\"not assessed\",C8=\"not assessed\",D8=\"not assessed\"),\"N/A\",IF(I8=\"Low\",1,IF(I8=\"Medium with Accepted Risk Strategy\",2,IF(I8=\"Medium\",3,IF(I8=\"High with Accepted Risk Strategy\",4,IF(I8=\"High\",5,\"\"))))))","v":""},{"$f":"(IF(J8=\"n/a\",0,IF(Dashboard!$Q$22=\"Small\",(Parameters!I16),IF(Dashboard!$Q$22=\"Large\",(Parameters!J16)))*J8))","v":{"$error":"#VALUE!"}}]
{"$rows_left_out":35}
{"sheet":"Dashboard","index":7,"n_rows":38,"n_cols":21,"rows_kept":38,"cut":false,"hidden":false,"merged":[[7,0,7,14],[27,3,27,5],[26,3,26,5],[25,3,25,5],[9,3,10,6],[10,12,10,13],[24,3,24,5],[15,3,15,7],[37,3,37,5],[36,3,36,5],[35,3,35,5],[34,3,34,5],[33,3,33,5],[32,3,32,5],[31,3,31,5],[30,3,30,5],[28,3,28,5],[29,3,29,5]]}
[]
[]
[]
[]
[]
[]
[]
["Office of Shared Solutions and Performance Improvement\nMigration Risk Profile Assessment "]
{"$rows_left_out":31}
{"sheet":"Parameters","index":8,"n_rows":43,"n_cols":15,"rows_kept":43,"cut":false,"hidden":false,"merged":[[29,1,32,5],[14,8,14,9],[14,2,14,3],[14,4,14,5],[14,6,14,7]]}
[null,"Risk Category Weighting Table - For OSSPI Input Only"]
[null,"Directions: Input weighting value by project size (small, large) as desired. Weighting values will automatically update throughout the workbook. "]
[]
[null,"Project Scope\n(select all that apply):  ","Project Size","Large"]
[null,null,null,null,null,null,null,null,null,null,null,null,null,"Small","Acquisitions"]
[null,null,null,null,null,null,null,null,null,null,null,null,null,"Large","Financial Management"]
[null,null,null,null,null,null,null,null,null,null,null,null,null,null,"Grants"]
[]
{"$rows_left_out":36}
{"sheet":"Approach","index":9,"n_rows":6,"n_cols":2,"rows_kept":6,"cut":false,"hidden":false,"merged":[]}
[null,"OSSPI Risk Assessment Approach"]
[null,"OSSPI’s risk assessment objective is to provide for a comprehensive, independent, objective review of project risk at each M3 phase. The risk analysis serves as a standardized risk assessment framework for listing key risk criteria to help agencies better assess and identify risk areas in Shared Services migrations and IT modernization efforts. The criteria document important risk triggers that can help agencies recognize risk factors and properly confront and deal with risk. "]
[null,"I. ERM Playbook\nReviewed the Chief Financial Officers Council (CFOC) and the Performance Improvement Council (PIC) Playbook: Enterprise Risk Management for the U.S. Federal Government. The goal of the ERM playbook is to promote a common understanding of ERM practices in agencies to support effective and efficient mission delivery and decision-making processes. The ERM playbook provides a list of common risk categories and their definitions in Appendix A. The list is a helpful starting point for ensuring that common risk areas are represented in the risk analysis, and serves as a commonality in both risk language and high-level categories for assessing risk between OMB and OSSPI. This is not intended to be a complete list, as the ERM playbook states. "]
[null,"II. Program-Specific Risk Criteria\nAdded significant risk criteria not represented in ERM Playbook through:\n• OMB Risk Areas in other risk documents\n• ERM Playbook’s Key Questions to Help Develop a Risk Profile"]
[null,"III. OSSPI M3 Playbook Requirements/Documentation\nAssessed risk criteria that are embedded in M3 Playbook, integrated language used in the M3 Playbook, and identified where information regarding applicable risk criteria can be found in required M3 documentation. The objective is to provide continuity between the M3 Phases and risk criteria, as well as to help build trust with providers and customers by demonstrating that OSSPI utilizes the required documentation in the M3 process. "]
[null,"IV. Government Accountability Office (GAO) Reports and Recommendations\nReviewed the following GAO reports to identify common trends found by GAO that are frequent triggers for risk in IT projects/management: \n● Agencies Need to Fully Consider Risks When Rating Their Major Investments. Rep. no. GAO-16-494. Washington: GAO, 2016. Print & Web. \n● A Framework for Assessing and Improving Process Maturity. Rep. no. GAO-04-394G. Washington: GAO, 2004. Print & Web. \n● Opportunities Exist to Improve Transparency and Oversight of Investment Risk at Select Agencies. Rep. no. GAO-13-98. Washington: GAO, 2012. Print & Web."]