{"text_format":"1","workbook":"xlsx","n_sheets":6,"sheets":["Cover","Workbook Overview","Capablity Guidelines","Legend","Business Capabilities","Capability Totals"],"not_rendered":{"charts":0,"images":0,"macros":1,"external_links":1,"defined_names":7,"comments":0,"pivot_tables":0},"unopened":[],"bounds":{"document_bytes":16777216,"sheet_cells":100000,"rows_first":2000,"rows_last":500,"rows_between":2000,"halvings":0,"cell_chars":16384,"cell_head_chars":4096},"cells_cut":0,"cells_raw":0,"read":"whole","date_system":"1900"}

{"sheet":"Cover","index":0,"n_rows":14,"n_cols":4,"rows_kept":14,"cut":false,"hidden":false,"merged":[[0,0,0,3],[3,0,13,0],[3,1,13,1],[3,3,13,3]]}
["Grants Management \nFederal Integrated Business Framework \nBusiness Capabilities"]
["Version","Date","Change Description","Status"]
[1,"2018-11-06","Posted on www.ussm.gsa.gov","Approved by OMB"]
[2,"2021-05-20","Proposed business capability additions and updates reflecting (1) Single Audit intake modernization and (2) 2 CFR Update include:","2021-06-22"]
[null,null,"- Consolidated risk management capabilities into new Service Activity GRM.040.050 Grant Award Risk Management"]
[null,null,"- Clarified capabilities to share award recipient risk information to a (to be determined) “OMB-designated repository” in addition to agency system(s)"]
[null,null,"- Consolidated capabilities for establishing receivable for award recipient repayment in the event of disallowed costs and funds paid in advance and not authorized to retain"]
[null,null,"- Refined capabilities for waiver of prior written approvals and alleviating requirements based on risk evaluation results"]
[null,null,"- Modified indirect cost rate capabilities to specify submission of rate to OMB-designated repository"]
[null,null,"- Refined capabilities and added references for new CFR Part on Never Contract with the Enemy"]
[null,null,"- Modified program set-up and notice of funding capabilities to include performance goal, target, baseline, and outcome data"]
[null,null,"- Modified award renewal and award modification capabilities to include adjustments to period of performance"]
[null,null,"- Updated authoritative references to align with renumbered sections"]
[null,null,"- Aligned language with 2 CFR updates (e.g., \"award\" to \"Federal award\", \"CFDA\" to \"assistance listing\", \"risk profile\" to \"risk evaluation information\")"]

{"sheet":"Workbook Overview","index":1,"n_rows":8,"n_cols":2,"rows_kept":8,"cut":false,"hidden":false,"merged":[[0,0,0,1]]}
["The worksheets in this workbook identify and provide background information for the Grants Management Business Capabilities.  \n\n\n\n"]
["Tab","Description"]
["Cover","Provides the publication date and change history of the Business Capabilities workbook"]
["Workbook Overview","Lists each workbook tab and provides an explanation of the tab's contents"]
["Capability Guidelines","Provides principles and guidance for developing the Business Capabilities"]
["Legend","Defines each field on the Business Capabilities tab"]
["Business Capabilities","Identifies the Business Capabilities derived from Authoritative References and Other Sources"]
["Capability  Totals","Provides counts of the Business Capabilities for each Service Activity"]

{"sheet":"Capablity Guidelines","index":2,"n_rows":56,"n_cols":1,"rows_kept":56,"cut":false,"hidden":false,"merged":[]}
["FIBF Overview and Business Capabilities Description"]
["The Federal Integrated Business Framework (FIBF) is a model for defining common mission support services. FIBF enables agencies to better coordinate their business needs by emphasizing required outcomes, data flow, process and performance standards."]
[]
["The Business Capabilities describe specific business actions that need to be performed to accomplish a Grants Management Service Activity."]
[]
["Guiding Principles"]
["Business Capabilities:"]
["· Define the “inputs”, “processes”, and “outputs” (“Lego blocks”) needed to accomplish activities for a Service Area"]
["– The combination of all the “Lego blocks” represents all the capabilities that are needed by all the agencies/programs; however,"]
["– Not all “Lego blocks” are needed/used by all agencies/programs (Business Scenarios and Business Use Cases provide information on when they are needed/used)"]
["• Derive from information in Authoritative References but do not replicate details contained in Authoritative References"]
["• Are written from the perspective of the Federal government (not the public or non-Federal entity)"]
["• Focus on the what, not the how - what business information needs to come in, what business outcome needs to be accomplished in a process, what business information needs to be provided"]
["• Address the full lifecycle business process, even if no Authoritative Reference addresses it.  In those cases, capabilities are created that reflect the necessary flow of information through the process, and bring these potential gaps to the attention of the Service Area’s LoB Managing Partner."]
["• Use language that is agnostic to:"]
["– Specific agency/program "]
["– Who performs the process (e.g., service consumer, internal service organization, external service provider)"]
["– System, technology, solution, manual/automated. Choose terms that are neutral to automated/manual and any specific system/solution (shared Federal or commercial service, custom commercial off-the-shelf/Government off-the-shelf (COTS/GOTS) technology)"]
["– Specific vendor services/software products"]
["• Focus on Federal agency processes and information within the boundary of the target Service Area and be cognizant of the terminology of interfacing Service Area(s) "]
{"$rows_left_out":37}
{"sheet":"Legend","index":3,"n_rows":8,"n_cols":3,"rows_kept":8,"cut":false,"hidden":false,"merged":[]}
["Column","Template Field","Template Field Content"]
["A","GRM Function ID and Name","Provides unique identifier and name for service function. For example, GRM.010 Grant Program Administration, GRM.020 Grant Pre-Award Management, etc.\n\nService Function is a breakdown of an administrative or mission-support Service Area into categories of services provided to service consumers. "]
["B","GRM Activity ID and Name","Provides unique identifier used to represent the Service Activity and Name. For example, GRM.010.010 Grant Program Set-up and Maintenance, GRM.010.020 Grant Program Funding Opportunity, etc.\n\nService Activities are processes within a Service Function, that provide identifiable outputs/outcomes to service consumers."]
["C","Capability ID","Provides the Identifier for the capability. The identifier components are  <service area>.<service function number>.<service activity number>.<sequential number, including process group and unique number> . \n\nFor example, a capability mapped to the Service Activity \"Grant Application Review and Selection, and numbered GRM.020.020.011, has the following elements:\n• “GRM” is the service area\n• “.020” is the service function number \n• “.020” is the service activity number \n• Second digit of “.011” is the unique process group within the service activity (group of inputs, processes, and outputs) and is numbered by multiples of 10, e.g., 01x, 02x, 03x, . . . 09x, 10x, 11x, etc.\n• Third digit of “.011” is the unique number of the capability within the process group\n\nIf there are more than 9 capabilities associated with a process group (e.g., when there are large numbers of inputs or outputs), continue numbering with the next sequential number, e.g., \"028, 029, 030, 031, 032\" then start the next process group with the next multiple of 10 in the sequence, e.g., \"040.\""]
["D","(I)input\n(P)process\n(O)output","Classifies the capability as a unique:\nInput (I) - Information that is captured and used by the process\nProcess (P) - Task to be performed and results recorded/documented\nOutput (O) - Information that is provided as a result of task performance\n\nExamples for the inputs, processes, and outputs are sometimes included parenthetically in the capability statement.  "]
["E","Business Capability Statement","Contains the capability statements and the applicable short Authoritative Reference name, e.g., \"Uniform Guidance.\" The statements contain the phrases “consistent with” and “as specified by” to describe the association with the authoritative source.\n\nThe capability statements are derived from Authoritative References and Other Sources and comprise:\n• Data required by Federal statutes, standards, or guidance to accomplish grants management processes;\n• Unique processes performed by the Federal Government throughout the grants management lifecycle;\n• Data required to be exchanged between Federal agencies or reported from agency systems as Federal statutes, standards, or guidance require."]
["F","Authoritative Reference","Provides the current Federal regulatory authoritative source(s) that contains business process and data requirements"]
["G","Other Sources ","Provides non-current/non-authoritative references to other Federal documents or materials that contain guidance on business processes and data"]

{"sheet":"Business Capabilities","index":4,"n_rows":751,"n_cols":7,"rows_kept":751,"cut":false,"hidden":false,"merged":[]}
["GRM Function ID and Name","GRM Activity ID and Name","Capability ID","(I)input\n(P)process\n(O)output","Business Capability Statement","Authoritative Reference","Other Sources"]
["GRM.010 Grant Program Administration","GRM.010.010 Grant Program Set-up and Maintenance","GRM.010.010.011","I","Capture Federal authorizing legislation for grant program consistent with PL 95-224","Public Law 95-224 Federal Grant and Cooperative Agreement Act"]
["GRM.010 Grant Program Administration","GRM.010.010 Grant Program Set-up and Maintenance","GRM.010.010.012","P","Identify and document special program requirements (e.g., oversight reporting), if any, from the Federal authorizing legislation consistent with Uniform Guidance","2 CFR 200.105; 2 CFR 200.211; Appendix I to Part 200"]
["GRM.010 Grant Program Administration","GRM.010.010 Grant Program Set-up and Maintenance","GRM.010.010.013","O","Provide special program requirements (e.g., oversight reporting), if any, from the Federal authorizing legislation consistent with Uniform Guidance","2 CFR 200.105; 2 CFR 200.211; Appendix I to Part 200"]
["GRM.010 Grant Program Administration","GRM.010.010 Grant Program Set-up and Maintenance","GRM.010.010.031","P","Develop, document, or update grant program scope, description, purpose, goals, objectives, and eligibility and document results as specified by Uniform Guidance","2 CFR 200.201; 2 CFR 200.202; 2 CFR 200.203; 2 CFR 200.204; Appendix I to Part 200; U.S.C. authorizing statutes"]
["GRM.010 Grant Program Administration","GRM.010.010 Grant Program Set-up and Maintenance","GRM.010.010.032","O","Provide grant program scope, description, purpose, goals, objectives, and eligibility for program package consistent with Uniform Guidance","2 CFR 200.201; 2 CFR 200.202; 2 CFR 200.203; 2 CFR 200.204; Appendix I to Part 200; U.S.C. authorizing statutes"]
["GRM.010 Grant Program Administration","GRM.010.010 Grant Program Set-up and Maintenance","GRM.010.010.041","P","Determine appropriate Federal award instrument (e.g., grant, cooperative agreement, contract) for the program and document results consistent with Uniform Guidance","2 CFR 200.201","JFMIP Grant Financial System Requirements, 2000, Grants Overview Process"]
["GRM.010 Grant Program Administration","GRM.010.010 Grant Program Set-up and Maintenance","GRM.010.010.042","O","Provide appropriate Federal award instrument for the program consistent with Uniform Guidance","2 CFR 200.201","JFMIP Grant Financial System Requirements, 2000, Grants Overview Process"]
["GRM.010 Grant Program Administration","GRM.010.010 Grant Program Set-up and Maintenance","GRM.010.010.051","P","Confirm or obtain Assistance Listing number and document results consistent with Uniform Guidance","2 CFR 200.1; 2 CFR 200.203"]
["GRM.010 Grant Program Administration","GRM.010.010 Grant Program Set-up and Maintenance","GRM.010.010.052","O","Provide Assistance Listing number consistent with Uniform Guidance","2 CFR 200.1; 2 CFR 200.203"]
["GRM.010 Grant Program Administration","GRM.010.010 Grant Program Set-up and Maintenance","GRM.010.010.061","P","Develop or update grant program performance measures, targets, baseline information, information collection, and expected outcomes and document results as specified by Uniform Guidance","2 CFR 200.202; 2 CFR 200.211; 2 CFR 200.301; Appendix 1 to Part 200"]
["GRM.010 Grant Program Administration","GRM.010.010 Grant Program Set-up and Maintenance","GRM.010.010.062","O","Provide grant program performance measures, targets, baseline information, information collection, and expected outcomes as specified by Uniform Guidance","2 CFR 200.202; 2 CFR 200.211; 2 CFR 200.301; Appendix 1 to Part 200"," "]
["GRM.010 Grant Program Administration","GRM.010.010 Grant Program Set-up and Maintenance","GRM.010.010.071","P","Determine level of federal agency involvement in cooperative agreement and document results consistent with Uniform Guidance","Grants and Cooperative Agreement Act (31 U.S.C 6301-08)"]
["GRM.010 Grant Program Administration","GRM.010.010 Grant Program Set-up and Maintenance","GRM.010.010.072","O","Provide level of federal agency involvement in cooperative agreement consistent with Uniform Guidance","Grants and Cooperative Agreement Act (31 U.S.C 6301-08)"]
["GRM.010 Grant Program Administration","GRM.010.010 Grant Program Set-up and Maintenance","GRM.010.010.081","P","Determine shared costs and matching funds contribution applicable to the grant program and document results consistent with Uniform Guidance","2 CFR 200.201; 2 CFR 200.306; 2 CFR 200.403; Redbook Chapter 10"]
["GRM.010 Grant Program Administration","GRM.010.010 Grant Program Set-up and Maintenance","GRM.010.010.082","O","Provide shared costs and matching funds contribution applicable to the grant program consistent with Uniform Guidance","2 CFR 200.201; 2 CFR 200.306; 2 CFR 200.403; Redbook Chapter 10"]
["GRM.010 Grant Program Administration","GRM.010.010 Grant Program Set-up and Maintenance","GRM.010.010.091","P","Develop or update grant program funding formula calculation and document results","No Authoritative Reference Identified"]
["GRM.010 Grant Program Administration","GRM.010.010 Grant Program Set-up and Maintenance","GRM.010.010.092","O","Provide grant program funding formula calculation","No Authoritative Reference Identified"]
["GRM.010 Grant Program Administration","GRM.010.010 Grant Program Set-up and Maintenance","GRM.010.010.101","I","Capture Federal regulatory, Federal statutory and agency-specific policy/guidance information applicable to grant program consistent with Uniform Guidance","2 CFR 200.203"]
["GRM.010 Grant Program Administration","GRM.010.010 Grant Program Set-up and Maintenance","GRM.010.010.102","I","Capture Federal and agency-specific policy information on indirect cost rate reimbursement and limitations or exclusions as to types or amount of cost items applicable to the grant program consistent with Uniform Guidance","2 CFR 200.403; 2 CFR 200.414; Appendix III to Part 200"]
{"$rows_left_out":732}
{"sheet":"Capability Totals","index":5,"n_rows":20,"n_cols":7,"rows_kept":20,"cut":false,"hidden":false,"merged":[[0,0,0,6],[1,1,1,2],[2,0,3,0],[16,0,17,0],[14,0,15,0],[8,0,13,0],[6,0,7,0],[4,0,5,0]]}
["GRM Business Capability Counts"]
["GRM Service Function","GRM Service Activity",null,"Inputs","Processes","Outputs","Total"]
["GRM.010 Grant Program Administration","GRM.010.010","Grant Program Set-up and Maintenance",{"$f":"COUNTIFS('Business Capabilities'!$B$2:$B$753,'Capability Totals'!B3&\" \"&'Capability Totals'!C3,'Business Capabilities'!$D$2:$D$753,\"I\")","v":9},{"$f":"COUNTIFS('Business Capabilities'!$B$2:$B$753,'Capability Totals'!B3&\" \"&'Capability Totals'!C3,'Business Capabilities'!$D$2:$D$753,\"P\")","v":17},{"$f":"COUNTIFS('Business Capabilities'!$B$2:$B$753,'Capability Totals'!B3&\" \"&'Capability Totals'!C3,'Business Capabilities'!$D$2:$D$753,\"O\")","v":17},{"$f":"SUM(D3:F3)","v":43}]
[null,"GRM.010.020","Grant Program Funding Opportunity",{"$f":"COUNTIFS('Business Capabilities'!$B$2:$B$753,'Capability Totals'!B4&\" \"&'Capability Totals'!C4,'Business Capabilities'!$D$2:$D$753,\"I\")","v":0},{"$f":"COUNTIFS('Business Capabilities'!$B$2:$B$753,'Capability Totals'!B4&\" \"&'Capability Totals'!C4,'Business Capabilities'!$D$2:$D$753,\"P\")","v":9},{"$f":"COUNTIFS('Business Capabilities'!$B$2:$B$753,'Capability Totals'!B4&\" \"&'Capability Totals'!C4,'Business Capabilities'!$D$2:$D$753,\"O\")","v":9},{"$f":"SUM(D4:F4)","v":18}]
["GRM.020 Grant Pre-Award Management","GRM.020.010","Grant Application Support and Receipt",{"$f":"COUNTIFS('Business Capabilities'!$B$2:$B$753,'Capability Totals'!B5&\" \"&'Capability Totals'!C5,'Business Capabilities'!$D$2:$D$753,\"I\")","v":6},{"$f":"COUNTIFS('Business Capabilities'!$B$2:$B$753,'Capability Totals'!B5&\" \"&'Capability Totals'!C5,'Business Capabilities'!$D$2:$D$753,\"P\")","v":5},{"$f":"COUNTIFS('Business Capabilities'!$B$2:$B$753,'Capability Totals'!B5&\" \"&'Capability Totals'!C5,'Business Capabilities'!$D$2:$D$753,\"O\")","v":6},{"$f":"SUM(D5:F5)","v":17}]
[null,"GRM.020.020","Grant Application Review and Selection",{"$f":"COUNTIFS('Business Capabilities'!$B$2:$B$753,'Capability Totals'!B6&\" \"&'Capability Totals'!C6,'Business Capabilities'!$D$2:$D$753,\"I\")","v":8},{"$f":"COUNTIFS('Business Capabilities'!$B$2:$B$753,'Capability Totals'!B6&\" \"&'Capability Totals'!C6,'Business Capabilities'!$D$2:$D$753,\"P\")","v":22},{"$f":"COUNTIFS('Business Capabilities'!$B$2:$B$753,'Capability Totals'!B6&\" \"&'Capability Totals'!C6,'Business Capabilities'!$D$2:$D$753,\"O\")","v":23},{"$f":"SUM(D6:F6)","v":53}]
["GRM.030 Grant Award Management","GRM.030.010","Grant Award Issuance",{"$f":"COUNTIFS('Business Capabilities'!$B$2:$B$753,'Capability Totals'!B7&\" \"&'Capability Totals'!C7,'Business Capabilities'!$D$2:$D$753,\"I\")","v":11},{"$f":"COUNTIFS('Business Capabilities'!$B$2:$B$753,'Capability Totals'!B7&\" \"&'Capability Totals'!C7,'Business Capabilities'!$D$2:$D$753,\"P\")","v":17},{"$f":"COUNTIFS('Business Capabilities'!$B$2:$B$753,'Capability Totals'!B7&\" \"&'Capability Totals'!C7,'Business Capabilities'!$D$2:$D$753,\"O\")","v":22},{"$f":"SUM(D7:F7)","v":50}]
[null,"GRM.030.020","Grant Award Payment Processing",{"$f":"COUNTIFS('Business Capabilities'!$B$2:$B$753,'Capability Totals'!B8&\" \"&'Capability Totals'!C8,'Business Capabilities'!$D$2:$D$753,\"I\")","v":5},{"$f":"COUNTIFS('Business Capabilities'!$B$2:$B$753,'Capability Totals'!B8&\" \"&'Capability Totals'!C8,'Business Capabilities'!$D$2:$D$753,\"P\")","v":14},{"$f":"COUNTIFS('Business Capabilities'!$B$2:$B$753,'Capability Totals'!B8&\" \"&'Capability Totals'!C8,'Business Capabilities'!$D$2:$D$753,\"O\")","v":17},{"$f":"SUM(D8:F8)","v":36}]
["GRM.040 Grant Post-Award Management and Closeout","GRM.040.010","Grant Award Modification",{"$f":"COUNTIFS('Business Capabilities'!$B$2:$B$753,'Capability Totals'!B9&\" \"&'Capability Totals'!C9,'Business Capabilities'!$D$2:$D$753,\"I\")","v":5},{"$f":"COUNTIFS('Business Capabilities'!$B$2:$B$753,'Capability Totals'!B9&\" \"&'Capability Totals'!C9,'Business Capabilities'!$D$2:$D$753,\"P\")","v":11},{"$f":"COUNTIFS('Business Capabilities'!$B$2:$B$753,'Capability Totals'!B9&\" \"&'Capability Totals'!C9,'Business Capabilities'!$D$2:$D$753,\"O\")","v":14},{"$f":"SUM(D9:F9)","v":30}]
[null,"GRM.040.020","Grant Award Performance Review",{"$f":"COUNTIFS('Business Capabilities'!$B$2:$B$753,'Capability Totals'!B10&\" \"&'Capability Totals'!C10,'Business Capabilities'!$D$2:$D$753,\"I\")","v":8},{"$f":"COUNTIFS('Business Capabilities'!$B$2:$B$753,'Capability Totals'!B10&\" \"&'Capability Totals'!C10,'Business Capabilities'!$D$2:$D$753,\"P\")","v":12},{"$f":"COUNTIFS('Business Capabilities'!$B$2:$B$753,'Capability Totals'!B10&\" \"&'Capability Totals'!C10,'Business Capabilities'!$D$2:$D$753,\"O\")","v":21},{"$f":"SUM(D10:F10)","v":41}]
[null,"GRM.040.030","Grant Award Financial Review",{"$f":"COUNTIFS('Business Capabilities'!$B$2:$B$753,'Capability Totals'!B11&\" \"&'Capability Totals'!C11,'Business Capabilities'!$D$2:$D$753,\"I\")","v":10},{"$f":"COUNTIFS('Business Capabilities'!$B$2:$B$753,'Capability Totals'!B11&\" \"&'Capability Totals'!C11,'Business Capabilities'!$D$2:$D$753,\"P\")","v":26},{"$f":"COUNTIFS('Business Capabilities'!$B$2:$B$753,'Capability Totals'!B11&\" \"&'Capability Totals'!C11,'Business Capabilities'!$D$2:$D$753,\"O\")","v":36},{"$f":"SUM(D11:F11)","v":72}]
[null,"GRM.040.040","Grant Award Compliance Review",{"$f":"COUNTIFS('Business Capabilities'!$B$2:$B$753,'Capability Totals'!B12&\" \"&'Capability Totals'!C12,'Business Capabilities'!$D$2:$D$753,\"I\")","v":12},{"$f":"COUNTIFS('Business Capabilities'!$B$2:$B$753,'Capability Totals'!B12&\" \"&'Capability Totals'!C12,'Business Capabilities'!$D$2:$D$753,\"P\")","v":22},{"$f":"COUNTIFS('Business Capabilities'!$B$2:$B$753,'Capability Totals'!B12&\" \"&'Capability Totals'!C12,'Business Capabilities'!$D$2:$D$753,\"O\")","v":38},{"$f":"SUM(D12:F12)","v":72}]
[null,"GRM.040.050","Grant Award Risk Management",{"$f":"COUNTIFS('Business Capabilities'!$B$2:$B$753,'Capability Totals'!B13&\" \"&'Capability Totals'!C13,'Business Capabilities'!$D$2:$D$753,\"I\")","v":1},{"$f":"COUNTIFS('Business Capabilities'!$B$2:$B$753,'Capability Totals'!B13&\" \"&'Capability Totals'!C13,'Business Capabilities'!$D$2:$D$753,\"P\")","v":2},{"$f":"COUNTIFS('Business Capabilities'!$B$2:$B$753,'Capability Totals'!B13&\" \"&'Capability Totals'!C13,'Business Capabilities'!$D$2:$D$753,\"O\")","v":3},{"$f":"SUM(D13:F13)","v":6}]
[null,"GRM.040.060","Grant Award Closeout",{"$f":"COUNTIFS('Business Capabilities'!$B$2:$B$753,'Capability Totals'!B14&\" \"&'Capability Totals'!C14,'Business Capabilities'!$D$2:$D$753,\"I\")","v":6},{"$f":"COUNTIFS('Business Capabilities'!$B$2:$B$753,'Capability Totals'!B14&\" \"&'Capability Totals'!C14,'Business Capabilities'!$D$2:$D$753,\"P\")","v":19},{"$f":"COUNTIFS('Business Capabilities'!$B$2:$B$753,'Capability Totals'!B14&\" \"&'Capability Totals'!C14,'Business Capabilities'!$D$2:$D$753,\"O\")","v":24},{"$f":"SUM(D14:F14)","v":49}]
["GRM.050 Grant Program Oversight","GRM.050.010","Grant Program Reporting and Review",{"$f":"COUNTIFS('Business Capabilities'!$B$2:$B$753,'Capability Totals'!B15&\" \"&'Capability Totals'!C15,'Business Capabilities'!$D$2:$D$753,\"I\")","v":1},{"$f":"COUNTIFS('Business Capabilities'!$B$2:$B$753,'Capability Totals'!B15&\" \"&'Capability Totals'!C15,'Business Capabilities'!$D$2:$D$753,\"P\")","v":13},{"$f":"COUNTIFS('Business Capabilities'!$B$2:$B$753,'Capability Totals'!B15&\" \"&'Capability Totals'!C15,'Business Capabilities'!$D$2:$D$753,\"O\")","v":14},{"$f":"SUM(D15:F15)","v":28}]
[null,"GRM.050.020","Grant Program Closeout",{"$f":"COUNTIFS('Business Capabilities'!$B$2:$B$753,'Capability Totals'!B16&\" \"&'Capability Totals'!C16,'Business Capabilities'!$D$2:$D$753,\"I\")","v":1},{"$f":"COUNTIFS('Business Capabilities'!$B$2:$B$753,'Capability Totals'!B16&\" \"&'Capability Totals'!C16,'Business Capabilities'!$D$2:$D$753,\"P\")","v":5},{"$f":"COUNTIFS('Business Capabilities'!$B$2:$B$753,'Capability Totals'!B16&\" \"&'Capability Totals'!C16,'Business Capabilities'!$D$2:$D$753,\"O\")","v":5},{"$f":"SUM(D16:F16)","v":11}]
["GRM.060 Grant Recipient Oversight","GRM.060.010","Grant Recipient Indirect Cost Rate Negotiation",{"$f":"COUNTIFS('Business Capabilities'!$B$2:$B$753,'Capability Totals'!B17&\" \"&'Capability Totals'!C17,'Business Capabilities'!$D$2:$D$753,\"I\")","v":7},{"$f":"COUNTIFS('Business Capabilities'!$B$2:$B$753,'Capability Totals'!B17&\" \"&'Capability Totals'!C17,'Business Capabilities'!$D$2:$D$753,\"P\")","v":7},{"$f":"COUNTIFS('Business Capabilities'!$B$2:$B$753,'Capability Totals'!B17&\" \"&'Capability Totals'!C17,'Business Capabilities'!$D$2:$D$753,\"O\")","v":7},{"$f":"SUM(D17:F17)","v":21}]
[null,"GRM.060.020","Grant Recipient Single Audit",{"$f":"COUNTIFS('Business Capabilities'!$B$2:$B$753,'Capability Totals'!B18&\" \"&'Capability Totals'!C18,'Business Capabilities'!$D$2:$D$753,\"I\")","v":33},{"$f":"COUNTIFS('Business Capabilities'!$B$2:$B$753,'Capability Totals'!B18&\" \"&'Capability Totals'!C18,'Business Capabilities'!$D$2:$D$753,\"P\")","v":72},{"$f":"COUNTIFS('Business Capabilities'!$B$2:$B$753,'Capability Totals'!B18&\" \"&'Capability Totals'!C18,'Business Capabilities'!$D$2:$D$753,\"O\")","v":98},{"$f":"SUM(D18:F18)","v":203}]
[]
[null,null,"Total",{"$f":"SUM(D3:D18)","v":123},{"$f":"SUM(E3:E18)","v":273},{"$f":"SUM(F3:F18)","v":354},{"$f":"SUM(G3:G18)","v":750}]